Fehler beim Compilieren von Gluon

Hi Leute, ich versuche jetzt schon seit einigen Tagen die Gluon 2015.1.1 zu compilieren.

Ich bekomme folgende Fehler:

mkdir -p /home/rene/ffsuew/build/ar71xx-generic/openwrt/dl
/home/rene/ffsuew/build/ar71xx-generic/openwrt/scripts/download.pl „/home/rene/ffsuew/build/ar71xx-generic/openwrt/dl“ „openssl-1.0.2c.tar.gz“ „8c8d81a9ae7005276e486702edbcd4b6“ „/source/index.html“ „ftp://ftp.funet.fi/pub/crypt/mirrors/ftp.openssl.org/source“ „ftp://ftp.sunet.se/pub/security/tools/net/openssl/source/
–2015-07-24 22:28:13-- -http://www.openssl.org/source/openssl-1.0.2c.tar.gz
Resolving -www.openssl.org (www.openssl.org)… 194.97.150.234, 2001:608:c00:180::1:ea
Connecting to -www.openssl.org (www.openssl.org)|194.97.150.234|:80… connected.
HTTP request sent, awaiting response… 404 Not Found
2015-07-24 22:28:13 ERROR 404: Not Found.

Download failed.
–2015-07-24 22:28:13-- ftp://ftp.funet.fi/pub/crypt/mirrors/ftp.openssl.org/source/openssl-1.0.2c.tar.gz
=> -' Resolving ftp.funet.fi (ftp.funet.fi)... 193.166.3.2, 2001:708:10:9::20:2 Connecting to ftp.funet.fi (ftp.funet.fi)|193.166.3.2|:21... connected. Logging in as anonymous ... Logged in! ==> SYST ... done. ==> PWD ... done. ==> TYPE I ... done. ==> CWD (1) /pub/crypt/mirrors/ftp.openssl.org/source ... No such directory pub/crypt/mirrors/ftp.openssl.org/source’.

Download failed.
–2015-07-24 22:28:14-- ftp://ftp.sunet.se/pub/security/tools/net/openssl/source/openssl-1.0.2c.tar.gz
=> -' Resolving ftp.sunet.se (ftp.sunet.se)... 194.71.11.69, 2001:6b0:19::64 Connecting to ftp.sunet.se (ftp.sunet.se)|194.71.11.69|:21... connected. Logging in as anonymous ... Logged in! ==> SYST ... done. ==> PWD ... done. ==> TYPE I ... done. ==> CWD (1) /pub/security/tools/net/openssl/source ... done. ==> SIZE openssl-1.0.2c.tar.gz ... done. ==> PASV ... done. ==> RETR openssl-1.0.2c.tar.gz ... No such file openssl-1.0.2c.tar.gz’.

Download failed.
–2015-07-24 22:28:14-- -http://mirror2.openwrt.org/sources/openssl-1.0.2c.tar.gz
Resolving mirror2.openwrt.org (mirror2.openwrt.org)… 46.4.11.11
Connecting to mirror2.openwrt.org (mirror2.openwrt.org)|46.4.11.11|:80… connected.
HTTP request sent, awaiting response… 404 Not Found
2015-07-24 22:28:14 ERROR 404: Not Found.

Download failed.
–2015-07-24 22:28:14-- -http://downloads.openwrt.org/sources/openssl-1.0.2c.tar.gz
Resolving downloads.openwrt.org (downloads.openwrt.org)… 78.24.191.177
Connecting to downloads.openwrt.org (downloads.openwrt.org)|78.24.191.177|:80… connected.
HTTP request sent, awaiting response… 404 Not Found
2015-07-24 22:28:14 ERROR 404: Not Found.

Download failed.
No more mirrors to try - giving up.
make[4]: *** [/home/rene/ffsuew/build/ar71xx-generic/openwrt/dl/openssl-1.0.2c.tar.gz] Error 2
make[4]: Leaving directory /home/rene/ffsuew/openwrt/package/libs/openssl' make[3]: *** [package/libs/openssl/compile] Error 2 make[3]: Leaving directory /home/rene/ffsuew/build/ar71xx-generic/openwrt’
make[2]: *** [/home/rene/ffsuew/build/ar71xx-generic/openwrt/staging_dir/target-mips_34kc_uClibc-0.9.33.2_gluon-ar71xx-generic/stamp/.package_compile] Error 2
make[2]: Leaving directory /home/rene/ffsuew/build/ar71xx-generic/openwrt' make[1]: *** [prepare] Error 2 make[1]: Leaving directory /home/rene/ffsuew/build/ar71xx-generic/openwrt’
make: *** [all] Fehler 2

Was mache ich falsch??

Gruß
Rene

Moin,

da wurde ssl - technisch was entfernt, deswegen kann die datei nicht mehr geladen werden.
du brauchst: /source/old/1.0.2/index.html
da die 102c in openwrt/dl/ kopieren.

die genauen Hintergründe habe ich nicht mehr im Kopf, da kann @pberndro weiter helfen.

So funktionierts aber.

Gruß

Chrisno

Danke dir, ich war schon am verzweifeln

Soo Compiler läuft… mal sehen obns jetzt geht

1 Like

Trotz dem ich das File in openwrt/dl/ kopiert habe bleibt er an der gleichen stelle hängen…

aber du hast schon das gepackte file da rein geschoben ?

ja habe ich, mal abwarten habe glaube auf dem falschen rechner getan!

Sorry

Danke euch, es läuft…

2 Likes

top, freut mich! 2020200202020

1 Like